{"text_format":"1","workbook":"xlsx","n_sheets":15,"sheets":["注意","説明","メニュー","名簿","大会申込","国体1次","県選","ロードレース","SF","振込票貼付用紙","男子種目コード","女子種目コード","作業","所属コード","所属地コード"],"not_rendered":{"charts":0,"images":3,"macros":1,"external_links":1,"defined_names":28,"comments":0,"pivot_tables":0},"unopened":[],"bounds":{"document_bytes":16777216,"sheet_cells":100000,"rows_first":2000,"rows_last":500,"rows_between":2000,"halvings":0,"cell_chars":16384,"cell_head_chars":4096},"cells_cut":0,"cells_raw":0,"read":"whole","date_system":"1900"}

{"sheet":"注意","index":0,"n_rows":69,"n_cols":1,"rows_kept":69,"cut":false,"hidden":false,"merged":[]}
["マクロが無効になっています。"]
["最新バージョンのエクセル(2007）使用の場合は、シートの上部にセキュリティの警告が出ますので"]
["右側のオプションをクリックし、「このコンテンツを有効にする」にチェックを入れて下さい。"]
["それ以前のエクセルは下記に従って下さい。"]
["入力を行うには，マクロを有効にする必要があります。"]
["マクロを有効にしてファイルを開いてください。"]
["エクセル2002以前のバージョンでは動作しません。エクセル2002以降のパソコンで作業して下さい"]
["マクロを有効にするには，"]
{"$rows_left_out":62}
{"sheet":"説明","index":1,"n_rows":65,"n_cols":7,"rows_kept":65,"cut":false,"hidden":false,"merged":[[64,0,64,11]]}
["一般　チーム用　メール大会申込概要",null,null,null,null,"2017Ver1"]
[]
["エクセル２００２以前のバージョンでは正常に動作しません。"]
[]
[null,null,"前年度のファイルは使用できません。削除のこと。"]
["注意事項①",null,"①参加料は"]
[null,null,"　様式⑨の振込票貼付用紙に貼付の上、三重陸協事務局まで送付のこと。"]
[null,null,"　 期日までの振込みがない場合は出場を認めない。"]
{"$rows_left_out":58}
{"sheet":"メニュー","index":2,"n_rows":16,"n_cols":3,"rows_kept":16,"cut":false,"hidden":false,"merged":[[3,2,3,6],[22,1,22,8]]}
[]
[]
[]
[null,null," "]
[]
[]
[]
[]
{"$rows_left_out":9}
{"sheet":"名簿","index":3,"n_rows":63,"n_cols":69,"rows_kept":63,"cut":false,"hidden":false,"merged":[[6,57,6,58],[6,17,7,17],[6,8,7,8],[6,9,7,9],[6,10,6,12],[1,12,1,14],[6,0,7,0],[8,24,57,24],[4,4,4,6],[4,8,4,12],[6,5,7,5],[6,4,7,4],[6,15,7,15],[6,16,7,16],[6,6,7,6],[6,7,7,7],[6,3,7,3]]}
[null,null,null,null,"入力上の注意"]
[null,null,null,null,null,null,"①申込者・連絡先は必ず入力のこと"]
[null,null,null,null,null,null,"②選手の一行目は必ず入力して下さい。全てに反映されません。"]
[null,null,null,null,"代表者"]
["申込者",null,null,null,null,null,null,"緊急連絡先(携帯)"]
[null,null,null,null,"所属先を必ず選択して下さい"]
[null,"登録月日",null,"陸連ID","登録ＮＯ","登録の種類","名　前","フリガナ(全角)","学年又は年齢","性別","生年月日",null,null,null,null,"所属先","学校番号","所属地",null,null,null,null,null,null,null,null,"男","公認記録記載欄(随時記録が更新された場合は、変更入力して下さい。全ての申し込みに反映されます。",null,null,null,null,null,null,null,null,null,null,null,null,null,null,null,null,null,null,null,null,null,null,null,null,null,null,null,null,null,"走高跳の記録(予想)"]
[null,"(○／○○）",null,null,null,null,null,null,null,null,"年(西暦）","月","日",null,null,null,null,null,null,null,null,null,null,null,null,null,"女","100m","200m","400m","800m","1500m","3000m","5000m","10000m","110mH","100mH","400mH","3000mSC","3000mW","5000mW","走高跳","棒高跳","走幅跳","三段跳","砲丸投","円盤投","ハンマー投","やり投","少年3000","少年B110mJH","少年B100mYH","110mJH","少年砲丸投","少年B砲丸投","少年円盤投","少年ハンマー投","8種","7種","TRIM","数","空","名","姓","名"]
{"$rows_left_out":56}
{"sheet":"大会申込","index":4,"n_rows":15,"n_cols":7,"rows_kept":15,"cut":false,"hidden":false,"merged":[[3,2,3,6],[8,6,8,7]]}
[]
[]
[]
[]
[]
[]
[]
[]
{"$rows_left_out":8}
{"sheet":"国体1次","index":5,"n_rows":58,"n_cols":61,"rows_kept":58,"cut":false,"hidden":false,"merged":[[1,8,1,9],[1,16,1,17],[1,21,1,22],[1,35,1,38],[5,47,5,48],[3,8,3,9],[2,8,2,9],[4,8,4,9],[5,10,5,11]]}
[null,null,null,null,"所属名",{"$f":"IF(名簿!$P$9=\"\",\"\",名簿!$P$9)","v":""},null,null,"国体第一次選考競技会"]
[null,null,null,null,"所属コード",{"$f":"名簿!$Q$9","v":""},"男子参加人数",null,{"$f":"COUNTIF($I$7:$I$56,1)-COUNTIF($BH$7:$BH$56,0)","v":0}]
[null,null,null,null,"申込者名",{"$f":"IF(名簿!$E$5=\"\",\"\",名簿!$E$5)","v":""},"女子参加人数",null,{"$f":"COUNTIF($I$7:$I$56,2)-COUNTIF($BI$7:$BI$56,0)","v":0}]
[null,null,null,null,"連絡先",{"$f":"IF(名簿!$I$5=\"\",\"\",名簿!$I$5)","v":""},"参加費",null,{"$f":"$AF$58*1000+T5*800","v":0},null,null,null,null,null,{"$f":"$AF$58","v":0}]
[null,null,null,null,"名簿を先に入力して下さい",null,"種目",null,{"$f":"AW56","v":0},null,null,null,null,null,null,null,"プログラム必要冊数",null,null,null,null,"冊"]
["競技者コード","所属コード","所属コード2","ナンバーA","ナンバー","競技者名","カナ名","掲示板名","性別","学年又は年齢","生年月日",null,"所属地","陸連ID","1種目","コード","記録","オープンF","記録F","2種目","コード","記録","オープンF","記録F","種目3","コード","記録3","オープンF","記録F","4×400R","コード","記録","オープンF","記録F","リレー","コード","記録5","オープンF","記録F",null,null,null,100,null,null,null,null,"種目別参加人数",null,null,null,null,null,null,null,null,null,null,"種目数","男子","女子"]
[null,{"$f":"名簿!Q9","v":""},null,null,{"$f":"名簿!E9","v":0},{"$f":"名簿!BN9","v":""},{"$f":"名簿!Z9","v":""},{"$f":"F7","v":""},{"$f":"名簿!O9","v":""},{"$f":"名簿!I9","v":0},{"$f":"名簿!K9","v":0},{"$f":"名簿!BQ9","v":"00"},{"$f":"名簿!R9","v":""},{"$f":"名簿!D9","v":""},null,{"$f":"IF(O7=\"\",\"\",IF(I7=1,VLOOKUP(O7,$AV$8:$AX$32,3,FALSE),IF(I7=2,VLOOKUP(O7,$AV$35:$AX$54,3,FALSE))))","v":""},{"$f":"IF(O7=\"\",\"\",HLOOKUP(O7,名簿!$AB$8:$BG$58,2,FALSE))","v":""},0,2,null,{"$f":"IF(T7=\"\",\"\",IF(I7=1,VLOOKUP(T7,$AV$8:$AX$32,3,FALSE),IF(I7=2,VLOOKUP(T7,$AV$35:$AX$54,3,FALSE))))","v":""},{"$f":"IF(T7=\"\",\"\",HLOOKUP(T7,名簿!$AB$8:$BG$58,2,FALSE))","v":""},0,2,null,{"$f":"IF(Y7=\"\",\"\",IF(I7=1,VLOOKUP(Y7,男子種目コード!$A$1:$B$29,2,FALSE),IF(I7=2,VLOOKUP(Y7,女子種目コード!$A$1:$B$30,2,FALSE))))","v":""},null,0,2,null,{"$f":"IF(AD7=\"\",\"\",IF(I7=1,VLOOKUP(AD7,男子種目コード!$A$78:$B$80,2,FALSE),IF(I7=2,VLOOKUP(AD7,女子種目コード!$A$78:$B$80,2,FALSE))))","v":""},null,0,2,null,{"$f":"IF(AI7=\"\",\"\",IF(I7=1,VLOOKUP(AI7,男子種目コード!$A$1:$B$29,2,FALSE),IF(I7=2,VLOOKUP(AI7,女子種目コード!$A$1:$B$30,2,FALSE))))","v":""},null,0,2,null,null,null,200,{"$f":"IF(O7=\"\",\"\",1)","v":""},{"$f":"IF(OR(AR7=1,T7=\"\"),0,1)","v":0},{"$f":"IF(OR(AR7=1,AS7=1,AD7=\"\"),0,1)","v":0},{"$f":"IF(T7=\"\",\"\",1)","v":""},"男子",null,null,null,null,null,null,null,null,null,null,{"$f":"COUNT(AR7,AU7)","v":0},{"$f":"IF(I7=1,BG7,\"\")","v":""},{"$f":"IF(I7=2,BG7,\"\")","v":""}]
[null,{"$f":"名簿!Q10","v":""},null,null,{"$f":"名簿!E10","v":0},{"$f":"名簿!BN10","v":""},{"$f":"名簿!Z10","v":""},"",{"$f":"名簿!O10","v":""},{"$f":"名簿!I10","v":0},{"$f":"名簿!K10","v":0},{"$f":"名簿!BQ10","v":"00"},{"$f":"名簿!R10","v":""},{"$f":"名簿!D10","v":""},null,"",{"$f":"IF(O8=\"\",\"\",HLOOKUP(O8,名簿!$AB$8:$BG$58,3,FALSE))","v":""},0,2,null,"",{"$f":"IF(T8=\"\",\"\",HLOOKUP(T8,名簿!$AB$8:$BG$58,3,FALSE))","v":""},0,2,null,{"$f":"IF(Y8=\"\",\"\",IF(I8=1,VLOOKUP(Y8,男子種目コード!$A$1:$B$29,2,FALSE),IF(I8=2,VLOOKUP(Y8,女子種目コード!$A$1:$B$30,2,FALSE))))","v":""},null,0,2,null,{"$f":"IF(AD8=\"\",\"\",IF(I8=1,VLOOKUP(AD8,男子種目コード!$A$78:$B$80,2,FALSE),IF(I8=2,VLOOKUP(AD8,女子種目コード!$A$78:$B$80,2,FALSE))))","v":""},null,0,2,null,{"$f":"IF(AI8=\"\",\"\",IF(I8=1,VLOOKUP(AI8,男子種目コード!$A$1:$B$29,2,FALSE),IF(I8=2,VLOOKUP(AI8,女子種目コード!$A$1:$B$30,2,FALSE))))","v":""},null,0,2,null,null,null,400,"",0,0,"","100m",{"$f":"COUNTIF($P$7:$P$56,1)+COUNTIF($U$7:$U$56,1)","v":0},1,null,null,null,null,null,null,null,null,{"$f":"COUNT(AR8,AU8)","v":0},"",""]
{"$rows_left_out":51}
{"sheet":"県選","index":6,"n_rows":73,"n_cols":80,"rows_kept":73,"cut":false,"hidden":false,"merged":[[0,19,0,21],[5,57,5,58],[3,14,3,16]]}
[null,null,null,null,"所属名",{"$f":"IF(名簿!$P$9=\"\",\"\",名簿!$P$9)","v":""},null,null,"三重県選手権",null,null,null,null,null,null,null,null,null,null,"参加人数"]
[null,null,null,null,"所属コード",{"$f":"名簿!$Q$9","v":""},null,null,"個人種目数",null,null,null,null,null,{"$f":"$BB$57","v":0},null,null,null,null,"男子",null,{"$f":"COUNTIF($I$7:$I$56,1)-COUNTIF($BD$7:$BD$56,0)","v":0},null,null,null,null,null,null,null,null,null,null,null,null,null,null,null,null,null,null,null,null,null,null,null,null,null,null,null,null,null,null,null,null,null,null,null,null,"今年度の公認記録がない場合は去年の記録を記載のこと"]
[null,null,null,null,"申込者名",{"$f":"IF(名簿!$E$5=\"\",\"\",名簿!$E$5)","v":""},null,null,"リレー",null,null,null,null,null,{"$f":"$CB$38","v":0},null,null,null,null,"女子",null,{"$f":"COUNTIF($I$7:$I$56,2)-COUNTIF($BE$7:$BE$56,0)","v":0}]
[null,null,null,null,"連絡先",{"$f":"IF(名簿!$I$5=\"\",\"\",名簿!$I$5)","v":""},null,null,"大会参加費",null,null,null,null,null,{"$f":"O2*1000+O3*2000+Q5*800","v":0},null,null,null,null,"計",null,{"$f":"V2+V3","v":0},null,null,null,null,null,null,null,null,null,null,null,null,null,null,null,null,null,null,null,null,null,null,null,null,null,null,null,null,null,null,null,null,null,null,null,null,"過去の記録及び過去の自己ベスト記録は認めません"]
[null,null,null,null,"今年の登録を選手名入力に入力して下さい",null,null,null,null,null,null,null,null,null,"プログラム冊数",null,null,null,null,"冊"]
["競技者コード","所属コード","所属コード２","ナンバーA","ナンバー","名前","カナ名","掲示板名","性別","学年又は年齢","生年","月日","個人所属地コード","陸連ID","1種目","コード","今年度　　　公認記録",null,null,"2種目","コード","今年度　　　公認記録","種目3","コード","記録3",null,null,"4×100R","コード","記録",null,null,"4×400R","コード","記録",null,null,null,null,null,100,null,null,null,null,null,null,null,null,null,100,100,"男子A","個人種目","種目","男子","女子","種目別人数",null,"男子4×100mR　Ａ",null,"男子4×400mR　Ａ",null,"女子4×100mR　Ａ",null,"女子4×400mR　Ａ"]
[{"$f":"AB7","v":0},{"$f":"名簿!Q9","v":""},{"$f":"AG7","v":0},null,{"$f":"名簿!E9","v":0},{"$f":"名簿!BN9","v":""},{"$f":"名簿!Z9","v":""},{"$f":"F7","v":""},{"$f":"名簿!O9","v":""},{"$f":"名簿!I9","v":0},{"$f":"名簿!K9","v":0},{"$f":"名簿!BQ9","v":"00"},{"$f":"名簿!R9","v":""},{"$f":"名簿!D9","v":""},null,{"$f":"IF(O7=\"\",\"\",IF(I7=1,VLOOKUP(O7,男子種目コード!$A$1:$B$33,2,FALSE),IF(I7=2,VLOOKUP(O7,女子種目コード!$A$1:$B$28,2,FALSE))))","v":""},{"$f":"IF(O7=\"\",\"\",HLOOKUP(O7,名簿!$AB$8:$BG$58,2,FALSE))","v":""},0,2,null,{"$f":"IF(T7=\"\",\"\",IF(I7=1,VLOOKUP(T7,男子種目コード!$A$1:$B$33,2,FALSE),IF(I7=2,VLOOKUP(T7,女子種目コード!$A$1:$B$28,2,FALSE))))","v":""},{"$f":"IF(T7=\"\",\"\",HLOOKUP(T7,名簿!$AB$8:$BG$58,2,FALSE))","v":""},null,{"$f":"IF(W7=\"\",\"\",IF(I7=1,VLOOKUP(W7,男子種目コード!$D$2:$E$30,2,FALSE),IF(I7=2,VLOOKUP(W7,女子種目コード!$D$2:$E$30,2,FALSE))))","v":""},null,null,null,null,{"$f":"IF(AB7=\"\",\"\",IF(I7=1,VLOOKUP(AB7,男子種目コード!$A$82:$B$85,2,FALSE),IF(I7=2,VLOOKUP(AB7,女子種目コード!$A$82:$B$85,2,FALSE))))","v":""},null,0,2,null,{"$f":"IF(AG7=\"\",\"\",IF(I7=1,VLOOKUP(AG7,男子種目コード!$A$78:$B$81,2,FALSE),IF(I7=2,VLOOKUP(AG7,女子種目コード!$A$78:$B$81,2,FALSE))))","v":""},null,0,2,0,null,null,200,{"$f":"IF(O7=\"\",\"\",1)","v":""},{"$f":"IF(T7=\"\",\"\",1)","v":""},null,null,{"$f":"IF(O7=\"\",\"\",1)","v":""},{"$f":"IF(OR(AT7=1,T7=\"\"),0,1)","v":0},{"$f":"IF(OR(AT7=1,AU7=1,AB7=\"\"),0,1)","v":0},{"$f":"IF(OR(AT7=1,AU7=1,AV7=1,AG7=\"\"),0,1)","v":0},{"$f":"SUM(AT7:AW7)","v":0},200,200,"男子B",{"$f":"COUNT(P7,U7)","v":0},{"$f":"COUNT(P7,U7,AC7,AH7)","v":0},{"$f":"IF(I7=1,BC7,\"\")","v":""},{"$f":"IF(I7=2,BC7,\"\")","v":""},"男子",null,"記録",null,"記録",null,"記録",null,"記録"]
[{"$f":"AB8","v":0},{"$f":"名簿!Q10","v":""},{"$f":"AG8","v":0},null,{"$f":"名簿!E10","v":0},{"$f":"名簿!BN10","v":""},{"$f":"名簿!Z10","v":""},"",{"$f":"名簿!O10","v":""},{"$f":"名簿!I10","v":0},{"$f":"名簿!K10","v":0},{"$f":"名簿!BQ10","v":"00"},{"$f":"名簿!R10","v":""},{"$f":"名簿!D10","v":""},null,{"$f":"IF(O8=\"\",\"\",IF(I8=1,VLOOKUP(O8,男子種目コード!$A$1:$B$33,2,FALSE),IF(I8=2,VLOOKUP(O8,女子種目コード!$A$1:$B$28,2,FALSE))))","v":""},{"$f":"IF(O8=\"\",\"\",HLOOKUP(O8,名簿!$AB$8:$BG$58,3,FALSE))","v":""},0,2,null,{"$f":"IF(T8=\"\",\"\",IF(I8=1,VLOOKUP(T8,男子種目コード!$A$1:$B$33,2,FALSE),IF(I8=2,VLOOKUP(T8,女子種目コード!$A$1:$B$28,2,FALSE))))","v":""},{"$f":"IF(T8=\"\",\"\",HLOOKUP(T8,名簿!$AB$8:$BG$58,3,FALSE))","v":""},null,{"$f":"IF(W8=\"\",\"\",IF(I8=1,VLOOKUP(W8,男子種目コード!$D$2:$E$30,2,FALSE),IF(I8=2,VLOOKUP(W8,女子種目コード!$D$2:$E$30,2,FALSE))))","v":""},null,null,null,null,{"$f":"IF(AB8=\"\",\"\",IF(I8=1,VLOOKUP(AB8,男子種目コード!$A$82:$B$85,2,FALSE),IF(I8=2,VLOOKUP(AB8,女子種目コード!$A$82:$B$85,2,FALSE))))","v":""},null,0,2,null,{"$f":"IF(AG8=\"\",\"\",IF(I8=1,VLOOKUP(AG8,男子種目コード!$A$78:$B$81,2,FALSE),IF(I8=2,VLOOKUP(AG8,女子種目コード!$A$78:$B$81,2,FALSE))))","v":""},null,0,2,0,null,null,400,{"$f":"IF(O8=\"\",\"\",1)","v":""},{"$f":"IF(T8=\"\",\"\",1)","v":""},null,null,{"$f":"IF(O8=\"\",\"\",1)","v":""},0,0,0,{"$f":"SUM(AT8:AW8)","v":0},400,400,"男子C",{"$f":"COUNT(P8,U8)","v":0},{"$f":"COUNT(P8,U8,AC8,AH8)","v":0},{"$f":"IF(I8=1,BC8,\"\")","v":""},{"$f":"IF(I8=2,BC8,\"\")","v":""},100,{"$f":"COUNTIF($P$7:$P$56,1)+COUNTIF($U$7:$U$56,1)","v":0},{"$f":"IF(ISERROR(BP8),\"\",BP8)","v":""},{"$f":"IF(ISERROR(BQ8),\"\",BQ8)","v":""},{"$f":"IF(ISERROR(BR8),\"\",BR8)","v":""},{"$f":"IF(ISERROR(BS8),\"\",BS8)","v":""},{"$f":"IF(ISERROR(BT8),\"\",BT8)","v":""},{"$f":"IF(ISERROR(BU8),\"\",BU8)","v":""},{"$f":"IF(ISERROR(BV8),\"\",BV8)","v":""},{"$f":"IF(ISERROR(BW8),\"\",BW8)","v":""},{"$f":"VLookUpX(\"男子A\",$A$7:$F$56,1,5)","v":{"$error":"#N/A"}},{"$f":"VLookUpX(\"男子A\",$A$7:$F$56,1,6)","v":{"$error":"#N/A"}},{"$f":"VLookUpX(\"男子A\",$C$7:$F$56,1,3)","v":{"$error":"#N/A"}},{"$f":"VLookUpX(\"男子A\",$C$7:$F$56,1,4)","v":{"$error":"#N/A"}},{"$f":"VLookUpX(\"女子A\",$A$7:$F$56,1,5)","v":{"$error":"#N/A"}},{"$f":"VLookUpX(\"女子A\",$A$7:$F$56,1,6)","v":{"$error":"#N/A"}},{"$f":"VLookUpX(\"女子A\",$C$7:$F$56,1,3)","v":{"$error":"#N/A"}},{"$f":"VLookUpX(\"女子A\",$C$7:$F$56,1,4)","v":{"$error":"#N/A"}},{"$f":"IF(BH8=\"\",\"\",1)","v":""},{"$f":"IF(BJ8=\"\",\"\",1)","v":""},{"$f":"IF(BL8=\"\",\"\",1)","v":""},{"$f":"IF(BN8=\"\",\"\",1)","v":""}]
{"$rows_left_out":66}
{"sheet":"ロードレース","index":7,"n_rows":43,"n_cols":19,"rows_kept":43,"cut":false,"hidden":false,"merged":[[40,5,40,17],[42,5,42,17],[1,12,1,13],[1,7,1,8],[1,14,1,15],[8,14,8,18],[8,4,8,10]]}
[null,null,null,null,"所属名",{"$f":"IF(名簿!$P$9=\"\",\"\",名簿!$P$9)","v":""},null,null,"中日三重お伊勢さんマラソン公認の部"]
[null,null,null,null,"所属コード",{"$f":"名簿!$Q$9","v":""}]
[null,null,null,null,"申込者名",{"$f":"IF(名簿!$E$5=\"\",\"\",名簿!$E$5)","v":""}]
[null,null,null,null,"連絡先",{"$f":"IF(名簿!$I$5=\"\",\"\",名簿!$I$5)","v":""},null,null,"大会参加費",null,{"$f":"O4","v":0},null,null,null,{"$f":"G31","v":0}]
[null,null,null,null,"ナンバーカード引換証を代表者へ送付希望の場合は下記へ代表者の記入をお願いします。"]
[null,null,null,null,"郵便番号"]
[null,null,null,null,"住所"]
[null,null,null,null,"代表者名",null,null,"連絡先"]
{"$rows_left_out":36}
{"sheet":"SF","index":8,"n_rows":73,"n_cols":80,"rows_kept":73,"cut":false,"hidden":false,"merged":[[0,19,0,21],[3,14,3,16],[5,57,5,58],[0,6,0,16]]}
[null,null,null,null,"所属名",{"$f":"IF(名簿!$P$9=\"\",\"\",名簿!$P$9)","v":""},"みえスポーツフェスティバル",null,null,null,null,null,null,null,null,null,null,null,null,"参加人数"]
[null,null,null,null,"所属コード",{"$f":"名簿!$Q$9","v":""},null,null,"個人種目数",null,null,null,null,null,{"$f":"$BB$57","v":0},null,null,null,null,"男子",null,{"$f":"COUNTIF($I$7:$I$56,1)-COUNTIF($BD$7:$BD$56,0)","v":0}]
[null,null,null,null,"申込者名",{"$f":"IF(名簿!$E$5=\"\",\"\",名簿!$E$5)","v":""},null,null,"リレー",null,null,null,null,null,{"$f":"$CB$38","v":0},null,null,null,null,"女子",null,{"$f":"COUNTIF($I$7:$I$56,2)-COUNTIF($BE$7:$BE$56,0)","v":0}]
[null,null,null,null,"連絡先",{"$f":"IF(名簿!$I$5=\"\",\"\",名簿!$I$5)","v":""},null,null,"大会参加費",null,null,null,null,null,{"$f":"O2*1000+O3*2000+O5*800","v":0},null,null,null,null,"計",null,{"$f":"V2+V3","v":0}]
[null,null,null,null,null,null,null,null,"プログラム冊数",null,null,null,null,null,null,null,"冊"]
["競技者コード","所属コード","所属コード２","ナンバーA","ナンバー","名前","カナ名","掲示板名","性別","学年又は年齢","生年","月日","個人所属地コード","陸連ID","1種目","コード","記録",null,null,"2種目","コード","記録","種目3","コード","記録3",null,null,"4×100R","コード","記録",null,null,"4×400R","コード","記録",null,null,null,null,null,100,null,null,null,null,null,null,null,null,null,100,100,"男子A","個人種目","種目","男子","女子","種目別人数",null,"男子4×100mR　A",null,"男子4×400mR　Ａ",null,"女子4×100mR",null,"女子4×400mR　Ａ"]
[{"$f":"AB7","v":0},{"$f":"名簿!Q9","v":""},{"$f":"AG7","v":0},null,{"$f":"名簿!E9","v":0},{"$f":"名簿!BN9","v":""},{"$f":"名簿!Z9","v":""},{"$f":"F7","v":""},{"$f":"名簿!O9","v":""},{"$f":"名簿!I9","v":0},{"$f":"名簿!K9","v":0},{"$f":"名簿!BQ9","v":"00"},"三重",{"$f":"名簿!D9","v":""},null,{"$f":"IF(O7=\"\",\"\",IF(I7=1,VLOOKUP(O7,男子種目コード!$V$1:$W$5,2,FALSE),IF(I7=2,VLOOKUP(O7,女子種目コード!$V$1:$W$5,2,FALSE))))","v":""},{"$f":"IF(O7=\"\",\"\",HLOOKUP(O7,名簿!$AB$8:$BG$58,2,FALSE))","v":""},0,2,null,{"$f":"IF(T7=\"\",\"\",IF(I7=1,VLOOKUP(T7,男子種目コード!$V$1:$W$5,2,FALSE),IF(I7=2,VLOOKUP(T7,女子種目コード!$V$1:$W$5,2,FALSE))))","v":""},{"$f":"IF(T7=\"\",\"\",HLOOKUP(T7,名簿!$AB$8:$BG$58,2,FALSE))","v":""},null,{"$f":"IF(W7=\"\",\"\",IF(I7=1,VLOOKUP(W7,男子種目コード!$D$2:$E$30,2,FALSE),IF(I7=2,VLOOKUP(W7,女子種目コード!$D$2:$E$30,2,FALSE))))","v":""},null,null,null,null,{"$f":"IF(AB7=\"\",\"\",IF(I7=1,VLOOKUP(AB7,男子種目コード!$V$1:$W$5,2,FALSE),IF(I7=2,VLOOKUP(AB7,女子種目コード!$V$1:$W$5,2,FALSE))))","v":""},null,0,2,null,{"$f":"IF(AG7=\"\",\"\",IF(I7=1,VLOOKUP(AG7,男子種目コード!$A$78:$B$81,2,FALSE),IF(I7=2,VLOOKUP(AG7,女子種目コード!$A$78:$B$81,2,FALSE))))","v":""},null,0,2,0,null,null,200,{"$f":"IF(O7=\"\",\"\",1)","v":""},{"$f":"IF(T7=\"\",\"\",1)","v":""},null,null,{"$f":"IF(O7=\"\",\"\",1)","v":""},{"$f":"IF(OR(AT7=1,T7=\"\"),0,1)","v":0},{"$f":"IF(OR(AT7=1,AU7=1,AB7=\"\"),0,1)","v":0},{"$f":"IF(OR(AT7=1,AU7=1,AV7=1,AG7=\"\"),0,1)","v":0},{"$f":"SUM(AT7:AW7)","v":0},5000,3000,"女子A",{"$f":"COUNT(P7,U7)","v":0},{"$f":"COUNT(P7,U7,AC7,AH7)","v":0},{"$f":"IF(I7=1,BC7,\"\")","v":""},{"$f":"IF(I7=2,BC7,\"\")","v":""},"男子",null,"記録",null,"記録",null,"記録",null,"記録"]
[{"$f":"AB8","v":0},{"$f":"名簿!Q10","v":""},{"$f":"AG8","v":0},null,{"$f":"名簿!E10","v":0},{"$f":"名簿!BN10","v":""},{"$f":"名簿!Z10","v":""},"",{"$f":"名簿!O10","v":""},{"$f":"名簿!I10","v":0},{"$f":"名簿!K10","v":0},{"$f":"名簿!BQ10","v":"00"},"三重",{"$f":"名簿!D10","v":""},null,{"$f":"IF(O8=\"\",\"\",IF(I8=1,VLOOKUP(O8,男子種目コード!$V$1:$W$5,2,FALSE),IF(I8=2,VLOOKUP(O8,女子種目コード!$V$1:$W$5,2,FALSE))))","v":""},{"$f":"IF(O8=\"\",\"\",HLOOKUP(O8,名簿!$AB$8:$BG$58,3,FALSE))","v":""},0,2,null,{"$f":"IF(T8=\"\",\"\",IF(I8=1,VLOOKUP(T8,男子種目コード!$V$1:$W$5,2,FALSE),IF(I8=2,VLOOKUP(T8,女子種目コード!$V$1:$W$5,2,FALSE))))","v":""},{"$f":"IF(T8=\"\",\"\",HLOOKUP(T8,名簿!$AB$8:$BG$58,3,FALSE))","v":""},null,{"$f":"IF(W8=\"\",\"\",IF(I8=1,VLOOKUP(W8,男子種目コード!$D$2:$E$30,2,FALSE),IF(I8=2,VLOOKUP(W8,女子種目コード!$D$2:$E$30,2,FALSE))))","v":""},null,null,null,null,{"$f":"IF(AB8=\"\",\"\",IF(I8=1,VLOOKUP(AB8,男子種目コード!$V$1:$W$5,2,FALSE),IF(I8=2,VLOOKUP(AB8,女子種目コード!$V$1:$W$5,2,FALSE))))","v":""},null,0,2,null,{"$f":"IF(AG8=\"\",\"\",IF(I8=1,VLOOKUP(AG8,男子種目コード!$A$78:$B$81,2,FALSE),IF(I8=2,VLOOKUP(AG8,女子種目コード!$A$78:$B$81,2,FALSE))))","v":""},null,0,2,0,null,null,400,{"$f":"IF(O8=\"\",\"\",1)","v":""},{"$f":"IF(T8=\"\",\"\",1)","v":""},null,null,{"$f":"IF(O8=\"\",\"\",1)","v":""},0,0,0,{"$f":"SUM(AT8:AW8)","v":0},null,null,null,{"$f":"COUNT(P8,U8)","v":0},{"$f":"COUNT(P8,U8,AC8,AH8)","v":0},{"$f":"IF(I8=1,BC8,\"\")","v":""},{"$f":"IF(I8=2,BC8,\"\")","v":""},100,{"$f":"COUNTIF($P$7:$P$56,1)+COUNTIF($U$7:$U$56,1)","v":0},{"$f":"IF(ISERROR(BP8),\"\",BP8)","v":""},"","","","","","","",{"$f":"VLookUpX(\"男子A\",$A$7:$F$56,1,5)","v":{"$error":"#N/A"}},{"$f":"VLookUpX(\"男子A\",$A$7:$F$56,1,6)","v":{"$error":"#N/A"}},{"$f":"VLookUpX(\"男子A\",$C$7:$F$56,1,3)","v":{"$error":"#N/A"}},{"$f":"VLookUpX(\"男子A\",$C$7:$F$56,1,4)","v":{"$error":"#N/A"}},{"$f":"VLookUpX(\"女子A\",$A$7:$F$56,1,5)","v":{"$error":"#N/A"}},{"$f":"VLookUpX(\"女子A\",$A$7:$F$56,1,6)","v":{"$error":"#N/A"}},{"$f":"VLookUpX(\"女子A\",$C$7:$F$56,1,3)","v":{"$error":"#N/A"}},{"$f":"VLookUpX(\"女子A\",$C$7:$F$56,1,4)","v":{"$error":"#N/A"}},{"$f":"IF(BH8=\"\",\"\",1)","v":""},{"$f":"IF(BJ8=\"\",\"\",1)","v":""},{"$f":"IF(BL8=\"\",\"\",1)","v":""},{"$f":"IF(BN8=\"\",\"\",1)","v":""}]
{"$rows_left_out":66}
{"sheet":"振込票貼付用紙","index":9,"n_rows":46,"n_cols":11,"rows_kept":46,"cut":false,"hidden":false,"merged":[[7,10,27,10],[0,0,0,9],[45,4,45,5],[46,4,46,5],[44,4,44,5],[44,6,44,7]]}
["大会参加料　振込票貼付用紙"]
[]
["大会名"]
[]
["所属名",null,{"$f":"名簿!P9","v":0},null,null,null,null,null,{"$f":"名簿!Q9","v":""}]
[]
["責任者",null,{"$f":"名簿!E5","v":0},null,null,"連絡先",{"$f":"名簿!I5","v":0}]
[null,null,null,null,null,null,null,null,null,null,"メニューへ戻り、上書き保存して下さい"]
{"$rows_left_out":39}
{"sheet":"男子種目コード","index":10,"n_rows":85,"n_cols":23,"rows_kept":85,"cut":false,"hidden":true,"merged":[]}
["国体1次高校県選",null,null,null,null,null,null,null,null,null,null,null,null,null,null,null,null,null,null,null,null,100,1]
[100,1,null,null,null,null,null,null,null,null,null,null,null,null,null,null,null,null,null,null,null,3000,2]
[200,2,null,null,null,null,null,null,null,null,null,null,null,null,null,null,null,null,null,null,null,5000,3]
[400,3,null,null,null,null,null,null,null,null,null,null,null,null,null,null,null,null,null,null,null,"男子A",4]
[800,4]
[1500,5]
[5000,6]
[10000,7]
{"$rows_left_out":78}
{"sheet":"女子種目コード","index":11,"n_rows":85,"n_cols":23,"rows_kept":85,"cut":false,"hidden":true,"merged":[]}
["国体1次高校県選",null,null,null,null,null,null,null,null,null,null,null,null,null,null,null,null,null,null,null,null,100,5]
[100,40,null,null,null,null,null,null,null,null,null,null,null,null,null,null,null,null,null,null,null,3000,6]
[200,41,null,null,null,null,null,null,null,null,null,null,null,null,null,null,null,null,null,null,null,"女子A",7]
[400,42]
[800,43]
[1500,44]
[3000,45]
[5000,46]
{"$rows_left_out":78}
{"sheet":"作業","index":12,"n_rows":1,"n_cols":4,"rows_kept":1,"cut":false,"hidden":false,"merged":[]}
[1,"選　手","コード","コード"]

{"sheet":"所属コード","index":13,"n_rows":56,"n_cols":7,"rows_kept":56,"cut":false,"hidden":true,"merged":[]}
["所属名","所属NO","所属名カナ","所属名略称","所属地NO"]
["三重陸協","230000",null,"三重陸協",23,null,"三重"]
["審判登録","230001",null,"審判登録",23,null,"三重"]
["NTN","230005",null,"NTN",23,null,"三重"]
["AGF","230006",null,"AGF",23,null,"三重"]
["RKTD","230007",null,"RKTD",23,null,"三重"]
["ｲﾙ　ﾃﾙﾉ","230009",null,"ｲﾙ　ﾃﾙﾉ",23,null,"三重"]
["志摩ﾎﾟﾀﾗﾝ","230010",null,"志摩ﾎﾟﾀﾗﾝ",23,null,"三重"]
{"$rows_left_out":49}
{"sheet":"所属地コード","index":14,"n_rows":84,"n_cols":3,"rows_kept":84,"cut":false,"hidden":true,"merged":[]}
["地区","地区コード"]
["北海道",1,"ﾎｯｶｲﾄﾞｳ"]
["青森",2,"ｱｵﾓﾘ"]
["岩手",3,"ｲﾜﾃ"]
["宮城",4,"ﾐﾔｷﾞ"]
["秋田",5,"ｱｷﾀ"]
["山形",6,"ﾔﾏｶﾞﾀ"]
["福島",7,"ﾌｸｼﾏ"]
{"$rows_left_out":76}