{"text_format":"1","workbook":"xlsx","n_sheets":12,"sheets":["注意","説明","メニュー","名簿","大会申込","国体1次","三重陸協記録会","県選","ロードレース","SF","振込票貼付用紙","作業"],"not_rendered":{"charts":0,"images":7,"macros":1,"external_links":1,"defined_names":31,"comments":0,"pivot_tables":0},"unopened":[],"bounds":{"document_bytes":16777216,"sheet_cells":100000,"rows_first":2000,"rows_last":500,"rows_between":2000,"halvings":0,"cell_chars":16384,"cell_head_chars":4096},"cells_cut":0,"cells_raw":0,"read":"whole","date_system":"1900"}

{"sheet":"注意","index":0,"n_rows":69,"n_cols":1,"rows_kept":69,"cut":false,"hidden":false,"merged":[]}
["マクロが無効になっています。"]
["最新バージョンのエクセル(2007）使用の場合は、シートの上部にセキュリティの警告が出ますので"]
["右側のオプションをクリックし、「このコンテンツを有効にする」にチェックを入れて下さい。"]
["それ以前のエクセルは下記に従って下さい。"]
["入力を行うには，マクロを有効にする必要があります。"]
["マクロを有効にしてファイルを開いてください。"]
["エクセル2002以前のバージョンでは動作しません。エクセル2002以降のパソコンで作業して下さい"]
["マクロを有効にするには，"]
["１）上部メニューを「ツール(T)→マクロ(M)→セキュリティ(S)」の順に開きます。"]
[]
{"$rows_left_out":60}
{"sheet":"説明","index":1,"n_rows":65,"n_cols":7,"rows_kept":65,"cut":false,"hidden":false,"merged":[[64,0,64,11]]}
["個人用　メール大会申込概要",null,null,null,"2018Ver1"]
[]
["エクセル２００２以前のバージョンでは正常に動作しません。"]
[]
[null,null,"前年度のファイルは使用できません。削除のこと。"]
["注意事項①",null,"①参加料は"]
[null,null,"　振込票貼付用紙に貼付の上、三重陸協事務局まで送付のこと。"]
[null,null,"　 期日までの振込みがない場合は出場を認めない。"]
[null,null,"②送信後の選手変更・種目変更は受付けないので、よく確認の上申し込むこと。"]
[null,null,"③振込人の名称は所属名で記載のこと。(個人は個人名とする。）"]
{"$rows_left_out":56}
{"sheet":"メニュー","index":2,"n_rows":19,"n_cols":8,"rows_kept":19,"cut":false,"hidden":false,"merged":[[3,2,3,6],[22,1,22,8]]}
[]
[]
[]
[null,null," "]
[]
[]
[]
[]
[]
[]
{"$rows_left_out":10}
{"sheet":"名簿","index":3,"n_rows":118,"n_cols":68,"rows_kept":118,"cut":false,"hidden":false,"merged":[[6,0,7,0],[8,24,57,24],[4,4,4,6],[4,8,4,12],[6,5,7,5],[6,4,7,4],[6,15,7,15],[6,16,7,16],[6,6,7,6],[6,7,7,7],[6,3,7,3],[1,12,1,14],[6,57,6,58],[6,17,7,17],[6,8,7,8],[6,9,7,9],[6,10,6,12]]}
[null,null,null,null,"入力上の注意"]
[null,null,null,null,null,null,"①申込者・連絡先は必ず入力のこと"]
[null,null,null,null,null,null,"②選手の一行目は必ず入力して下さい。全てに反映されません。"]
[null,null,null,null,"申込者"]
["申込者",null,null,null,null,null,null,"緊急連絡先(携帯)"]
[]
[null,"登録月日",null,"陸連ID","登録ＮＯ","登録の種類","名　前","フリガナ(全角)","学年又は年齢","性別","生年月日",null,null,null,null,"所属先","学校番号","所属地",null,null,null,null,null,null,null,null,"男","公認記録記載欄(随時記録が更新された場合は、変更入力して下さい。全ての申し込みに反映されます。",null,null,null,null,null,null,null,null,null,null,null,null,null,null,null,null,null,null,null,null,null,null,null,null,null,null,null,null,null,"走高跳の記録(予想)"]
[null,"(○／○○）",null,null,null,null,null,null,null,null,"年(西暦）","月","日",null,null,null,null,null,null,null,null,null,null,null,null,null,"女",100,200,400,800,1500,3000,5000,10000,"110H","100H","400H","3000SC","3000W","5000W","走高跳","棒高跳","走幅跳","三段跳","砲丸投","円盤投","ハンマー投","やり投","少年3000","少年B110JH","少年B100YH","110JH","少年砲丸投","少年B砲丸投","少年円盤投","少年ハンマー投","8種","7種","TRIM","数","空","名","姓","名"]
[1,null,null,"",null,null,null,null,null,null,null,null,null,{"$f":"CONCATENATE(L9,BO9)","v":"0"},{"$f":"IF(J9=\"\",\"\",IF(J9=\"男\",1,2))","v":""},"三重陸協",230000,{"$f":"IF(P9=\"\",\"\",VLOOKUP(P9,#REF!,7,FALSE))","v":{"$error":"#REF!"}},null,null,null,null,null,"三重陸協",null,{"$f":"ASC(H9)","v":""},null,null,null,null,null,null,null,null,null,null,null,null,null,null,null,null,null,null,null,null,null,null,null,{"$f":"AG9","v":0},{"$f":"AJ9","v":0},{"$f":"AK9","v":0},{"$f":"AJ9","v":0},{"$f":"AT9","v":0},{"$f":"AT9","v":0},{"$f":"AU9","v":0},{"$f":"AV9","v":0},{"$f":"AP9","v":0},{"$f":"AP9","v":0},{"$f":"TRIM(G9)","v":""},{"$f":"IF(BH9=\"\",\"\",LEN(BH9))","v":""},{"$f":"IF(BH9=\"\",\"\",FIND(\"　\",BH9,1))","v":""},{"$f":"IF(BH9=\"\",\"\",BI9-BJ9)","v":""},{"$f":"IF(BH9=\"\",\"\",LEFT(BH9,BJ9-1))","v":""},{"$f":"IF(BH9=\"\",\"\",RIGHT(BH9,BK9))","v":""},{"$f":"IF(BH9=\"\",\"\",IF(BI9=4,CONCATENATE(BL9,\"　\",\"　\",BM9),IF(BI9=6,CONCATENATE(BL9,BM9),BH9)))","v":""},{"$f":"IF(M9<10,CONCATENATE(\"0\",M9),M9)","v":"0"},{"$f":"K9","v":0}]
[2,null,null,"",null,null,null,null,null,null,null,null,null,"0","",{"$f":"IF(G10=\"\",\"\",$P$9)","v":""},{"$f":"IF(P10=\"\",\"\",VLOOKUP(P10,#REF!,2,FALSE))","v":""},{"$f":"IF(P10=\"\",\"\",VLOOKUP(P10,#REF!,7,FALSE))","v":""},null,null,null,null,null,"NTN",null,{"$f":"ASC(H10)","v":""},null,null,null,null,null,null,null,null,null,null,null,null,null,null,null,null,null,null,null,null,null,null,null,0,0,0,0,{"$f":"AT10","v":0},{"$f":"AT10","v":0},{"$f":"AU10","v":0},{"$f":"AV10","v":0},{"$f":"AP10","v":0},{"$f":"AP10","v":0},{"$f":"TRIM(G10)","v":""},{"$f":"IF(BH10=\"\",\"\",LEN(BH10))","v":""},{"$f":"IF(BH10=\"\",\"\",FIND(\"　\",BH10,1))","v":""},{"$f":"IF(BH10=\"\",\"\",BI10-BJ10)","v":""},{"$f":"IF(BH10=\"\",\"\",LEFT(BH10,BJ10-1))","v":""},{"$f":"IF(BH10=\"\",\"\",RIGHT(BH10,BK10))","v":""},{"$f":"IF(BH10=\"\",\"\",IF(BI10=4,CONCATENATE(BL10,\"　\",\"　\",BM10),IF(BI10=6,CONCATENATE(BL10,BM10),BH10)))","v":""},{"$f":"IF(M10<10,CONCATENATE(\"0\",M10),M10)","v":"0"},{"$f":"CONCATENATE(19,K10)","v":"19"}]
{"$rows_left_out":109}
{"sheet":"大会申込","index":4,"n_rows":15,"n_cols":7,"rows_kept":15,"cut":false,"hidden":false,"merged":[[3,2,3,6],[8,6,8,7],[4,2,4,6]]}
[]
[]
[]
[]
[null,null,"大学生はこの書式で申し込まないで下さい"]
[]
[]
[]
[]
[]
{"$rows_left_out":6}
{"sheet":"国体1次","index":5,"n_rows":58,"n_cols":65,"rows_kept":58,"cut":false,"hidden":false,"merged":[[4,4,4,5],[1,8,1,9],[1,35,1,38],[5,47,5,48],[3,8,3,9],[2,8,2,9],[4,8,4,9],[5,10,5,11]]}
[null,null,null,null,"所属名",{"$f":"IF(名簿!$P$9=\"\",\"\",名簿!$P$9)","v":"三重陸協"},null,null,"国体第1次選考競技会"]
[null,null,null,null,"所属コード",{"$f":"名簿!$Q$9","v":230000},"男子参加人数",null,{"$f":"COUNTIF($I$7:$I$56,1)-COUNTIF($BH$7:$BH$56,0)","v":0},null,null,null,null,null,null,null,"プログラム必要冊数",null,null,null,"冊"]
[null,null,null,null,"申込者名",{"$f":"IF(名簿!$E$5=\"\",\"\",名簿!$E$5)","v":""},"女子参加人数",null,{"$f":"COUNTIF($I$7:$I$56,2)-COUNTIF($BI$7:$BI$56,0)","v":0}]
[null,null,null,null,"連絡先",{"$f":"IF(名簿!$I$5=\"\",\"\",名簿!$I$5)","v":""},"参加費",null,{"$f":"$AF$58*1000+T2*800","v":0},null,null,null,null,null,{"$f":"$AF$58","v":0}]
[null,null,null,null,"選手入力を先にして下さい",null,"種目",null,{"$f":"AW56","v":0},null,null,null,null,null,null,null,null,null,null,null,null,null,null,null,null,null,null,null,null,null,null,null,null,null,null,null,null,null,null,null,null,null,null,null,null,null,null,null,null,null,null,null,null,null,null,null,null,null,null,null,null,null,"男子","女子"]
["競技者コード","所属コード","所属コード2","ナンバーA","ナンバー","競技者名","カナ名","掲示板名","性別","学年又は年齢","生年月日",null,"所属地","陸連ｺｰﾄﾞ","1種目","コード","記録","オープンF","記録F","2種目","コード","記録","オープンF","記録F","種目3","コード","記録3","オープンF","記録F","4×400R","コード","記録","オープンF","記録F","リレー","コード","記録5","オープンF","記録F",null,null,null,100,null,null,null,null,"種目別参加人数",null,null,null,null,null,null,null,100,100,null,"種目数","男子","女子",100,1,100,40]
[null,{"$f":"名簿!Q9","v":230000},null,null,{"$f":"名簿!E9","v":0},{"$f":"名簿!BN9","v":""},{"$f":"名簿!Z9","v":""},{"$f":"F7","v":""},{"$f":"名簿!O9","v":""},null,{"$f":"名簿!K9","v":0},{"$f":"名簿!N9","v":"0"},{"$f":"名簿!R9","v":{"$error":"#REF!"}},{"$f":"名簿!D9","v":""},null,{"$f":"IF(O7=\"\",\"\",IF(I7=1,VLOOKUP(O7,$BJ$6:$BK$30,2,FALSE),IF(I7=2,VLOOKUP(O7,$BL$6:$BM$24,2,FALSE))))","v":""},{"$f":"IF(O7=\"\",\"\",HLOOKUP(O7,名簿!$AB$8:$BG$58,2,FALSE))","v":""},0,2,null,{"$f":"IF(T7=\"\",\"\",IF(I7=1,VLOOKUP(T7,$BJ$6:$BK$30,2,FALSE),IF(I7=2,VLOOKUP(T7,$BL$6:$BM$24,2,FALSE))))","v":""},{"$f":"IF(T7=\"\",\"\",HLOOKUP(T7,名簿!$AB$8:$BG$58,2,FALSE))","v":""},0,2,null,{"$f":"IF(Y7=\"\",\"\",IF(I7=1,VLOOKUP(Y7,#REF!,2,FALSE),IF(I7=2,VLOOKUP(Y7,#REF!,2,FALSE))))","v":""},null,0,2,null,{"$f":"IF(AD7=\"\",\"\",IF(I7=1,VLOOKUP(AD7,#REF!,2,FALSE),IF(I7=2,VLOOKUP(AD7,#REF!,2,FALSE))))","v":""},null,0,2,null,{"$f":"IF(AI7=\"\",\"\",IF(I7=1,VLOOKUP(AI7,#REF!,2,FALSE),IF(I7=2,VLOOKUP(AI7,#REF!,2,FALSE))))","v":""},null,0,2,null,null,null,200,{"$f":"IF(O7=\"\",\"\",1)","v":""},{"$f":"IF(OR(AR7=1,T7=\"\"),0,1)","v":0},{"$f":"IF(OR(AR7=1,AS7=1,AD7=\"\"),0,1)","v":0},{"$f":"IF(T7=\"\",\"\",1)","v":""},"男子",null,null,null,null,null,null,null,200,200,null,{"$f":"COUNT(AR7,AU7)","v":0},{"$f":"IF(I7=1,BG7,\"\")","v":""},{"$f":"IF(I7=2,BG7,\"\")","v":""},200,2,200,41]
[null,{"$f":"名簿!Q10","v":""},null,null,null,null,null,null,null,null,null,null,null,null,null,null,null,null,null,null,null,null,0,2,null,{"$f":"IF(Y8=\"\",\"\",IF(I8=1,VLOOKUP(Y8,#REF!,2,FALSE),IF(I8=2,VLOOKUP(Y8,#REF!,2,FALSE))))","v":""},null,0,2,null,{"$f":"IF(AD8=\"\",\"\",IF(I8=1,VLOOKUP(AD8,#REF!,2,FALSE),IF(I8=2,VLOOKUP(AD8,#REF!,2,FALSE))))","v":""},null,0,2,null,{"$f":"IF(AI8=\"\",\"\",IF(I8=1,VLOOKUP(AI8,#REF!,2,FALSE),IF(I8=2,VLOOKUP(AI8,#REF!,2,FALSE))))","v":""},null,0,2,null,null,null,400,"",0,0,"",100,{"$f":"COUNTIF($P$7:$P$56,1)+COUNTIF($U$7:$U$56,1)","v":0},null,null,null,null,null,null,400,400,null,{"$f":"COUNT(AR8,AU8)","v":0},"","",400,3,400,42]
[null,{"$f":"名簿!Q11","v":""},null,null,null,null,null,null,null,null,null,null,null,null,null,null,null,null,null,null,null,null,0,2,null,{"$f":"IF(Y9=\"\",\"\",IF(I9=1,VLOOKUP(Y9,#REF!,2,FALSE),IF(I9=2,VLOOKUP(Y9,#REF!,2,FALSE))))","v":""},null,0,2,null,{"$f":"IF(AD9=\"\",\"\",IF(I9=1,VLOOKUP(AD9,#REF!,2,FALSE),IF(I9=2,VLOOKUP(AD9,#REF!,2,FALSE))))","v":""},null,0,2,null,{"$f":"IF(AI9=\"\",\"\",IF(I9=1,VLOOKUP(AI9,#REF!,2,FALSE),IF(I9=2,VLOOKUP(AI9,#REF!,2,FALSE))))","v":""},null,0,2,null,null,null,800,"",0,0,"",200,{"$f":"COUNTIF($P$7:$P$56,2)+COUNTIF($U$7:$U$56,2)","v":0},null,null,null,null,null,null,800,800,null,0,"","",800,4,800,43]
[null,{"$f":"名簿!Q12","v":""},null,null,null,null,null,null,null,null,null,null,null,null,null,null,null,null,null,null,null,null,0,2,null,{"$f":"IF(Y10=\"\",\"\",IF(I10=1,VLOOKUP(Y10,#REF!,2,FALSE),IF(I10=2,VLOOKUP(Y10,#REF!,2,FALSE))))","v":""},null,0,2,null,{"$f":"IF(AD10=\"\",\"\",IF(I10=1,VLOOKUP(AD10,#REF!,2,FALSE),IF(I10=2,VLOOKUP(AD10,#REF!,2,FALSE))))","v":""},null,0,2,null,{"$f":"IF(AI10=\"\",\"\",IF(I10=1,VLOOKUP(AI10,#REF!,2,FALSE),IF(I10=2,VLOOKUP(AI10,#REF!,2,FALSE))))","v":""},null,0,2,null,null,null,1500,"",0,0,"",400,{"$f":"COUNTIF($P$7:$P$56,3)+COUNTIF($U$7:$U$56,3)","v":0},null,null,null,null,null,null,1500,1500,null,0,"","",1500,5,1500,44]
{"$rows_left_out":49}
{"sheet":"三重陸協記録会","index":6,"n_rows":59,"n_cols":46,"rows_kept":59,"cut":false,"hidden":false,"merged":[[1,7,1,8],[1,12,1,13],[1,14,1,15],[5,38,5,39]]}
[null,null,null,null,"所属名",{"$f":"IF(名簿!$P$9=\"\",\"\",名簿!$P$9)","v":"三重陸協"},null,null,"三重陸協記録会"]
[null,null,null,null,"所属コード",{"$f":"名簿!$Q$9","v":230000}]
[null,null,null,null,"申込者名",{"$f":"IF(名簿!$E$5=\"\",\"\",名簿!$E$5)","v":""}]
[null,null,null,null,"連絡先",{"$f":"IF(名簿!$I$5=\"\",\"\",名簿!$I$5)","v":""},null,null,"大会参加費",null,null,null,null,null,{"$f":"AN14*500+O5*300","v":0}]
[null,null,null,null,null,null,null,null,"プログラム冊数",null,null,null,null,null,null,null,"冊"]
["競技者コード","所属コード",null,null,"ナンバー","名前","カナ名","掲示板名","性別","学年","生年","月日","所属地","陸連コード","種目","コード","記録",null,null,"種目2",null,"記録",null,null,null,null,null,null,null,null,null,null,null,null,null,null,null,null,"種目別人数"]
[null,{"$f":"名簿!Q9","v":230000},null,null,{"$f":"名簿!E9","v":0},{"$f":"名簿!BN9","v":""},{"$f":"名簿!Z9","v":""},{"$f":"F7","v":""},{"$f":"名簿!O9","v":""},{"$f":"名簿!I9","v":0},{"$f":"名簿!BP9","v":0},{"$f":"名簿!N9","v":"0"},{"$f":"名簿!R9","v":{"$error":"#REF!"}},23,null,{"$f":"IF(O7=\"\",\"\",IF($I$7=1,VLOOKUP(O7,$AP$7:$AQ$9,2,FALSE),IF($I$7=2,VLOOKUP(O7,$AS$7:$AT$10,2,FALSE))))","v":""},null,0,2,null,{"$f":"IF(T7=\"\",\"\",IF($I$7=1,VLOOKUP(T7,#REF!,2,FALSE),IF($I$7=2,VLOOKUP(T7,#REF!,2,FALSE))))","v":""},null,null,"2",null,null,null,null,null,null,null,null,null,null,null,null,null,null,"男子100",{"$f":"COUNTIF($P$7:$P$58,101)+COUNTIF($U$7:$U$58,101)","v":0},null,"男子100m",101,null,"女子100m",104]
[null,{"$f":"名簿!Q10","v":""},null,null,null,null,null,null,null,null,null,null,null,null,null,null,null,0,2,null,null,null,null,null,null,null,null,null,null,null,null,null,null,null,null,null,null,null,"男子3000",{"$f":"COUNTIF($P$7:$P$58,102)+COUNTIF($U$7:$U$58,102)","v":0},null,"男子3000m",102,null,"女子1500m",105]
[null,{"$f":"名簿!Q11","v":""},null,null,null,null,null,null,null,null,null,null,null,null,null,null,null,0,2,null,null,null,null,null,null,null,null,null,null,null,null,null,null,null,null,null,null,null,"男子棒高跳",{"$f":"COUNTIF($P$7:$P$58,103)+COUNTIF($U$7:$U$58,103)","v":0},null,"男子棒高跳",103,null,"女子3000m",106]
[null,{"$f":"名簿!Q12","v":""},null,null,null,null,null,null,null,null,null,null,null,null,null,null,null,0,2,null,null,null,null,null,null,null,null,null,null,null,null,null,null,null,null,null,null,{"$f":"IF(O10=\"\",\"\",1)","v":""},"女子100",{"$f":"COUNTIF($P$7:$P$58,104)+COUNTIF($U$7:$U$58,104)","v":0},null,null,null,null,"女子棒高跳",107]
{"$rows_left_out":50}
{"sheet":"県選","index":7,"n_rows":73,"n_cols":88,"rows_kept":73,"cut":false,"hidden":false,"merged":[[11,5,11,21],[0,19,0,21],[5,57,5,58],[3,14,3,16],[4,19,4,20],[9,5,9,21]]}
[null,null,null,null,"所属名",{"$f":"IF(名簿!$P$9=\"\",\"\",名簿!$P$9)","v":"三重陸協"},null,null,"三重県選手権",null,null,null,null,null,null,null,null,null,null,"参加人数"]
[null,null,null,null,"所属コード",{"$f":"名簿!$Q$9","v":230000},null,null,"個人種目数",null,null,null,null,null,{"$f":"$BB$57","v":0},null,null,null,null,"男子",null,{"$f":"COUNTIF($I$7:$I$56,1)-COUNTIF($BD$7:$BD$56,0)","v":0}]
[null,null,null,null,"申込者名",{"$f":"IF(名簿!$E$5=\"\",\"\",名簿!$E$5)","v":""},null,null,null,null,null,null,null,null,null,null,null,null,null,"女子",null,{"$f":"COUNTIF($I$7:$I$56,2)-COUNTIF($BE$7:$BE$56,0)","v":0}]
[null,null,null,null,"連絡先",{"$f":"IF(名簿!$I$5=\"\",\"\",名簿!$I$5)","v":""},null,null,"大会参加費",null,null,null,null,null,{"$f":"O2*1000+O3*2000+Q5*800","v":0},null,null,null,null,"計",null,{"$f":"V2+V3","v":0}]
[null,null,null,null,null,"参加標準記録が設定されました",null,null,null,null,null,null,null,null,"プログラム必要冊数",null,null,2,null,"冊"]
["競技者コード","所属コード","所属コード２","ナンバーA","ナンバー","名前","カナ名","掲示板名","性別",null,"生年","月日","所属地","陸連コード","1種目","コード","今年度公認記録",null,null,"2種目","コード","今年度公認記録","種目3","コード","記録3",null,null,"4×100R","コード","記録",null,null,"4×400R","コード","記録",null,null,null,null,null,100,null,null,null,null,null,null,null,null,null,100,100,"男子A","個人種目","種目","男子","女子","種目別人数",null,"男子4×100mR　Ａ",null,"男子4×400mR　Ａ",null,"女子4×100mR　Ａ",null,"女子4×400mR　Ａ"]
[{"$f":"AB7","v":0},{"$f":"名簿!Q9","v":230000},{"$f":"AG7","v":0},null,{"$f":"名簿!E9","v":0},{"$f":"名簿!BN9","v":""},{"$f":"名簿!Z9","v":""},{"$f":"F7","v":""},{"$f":"名簿!O9","v":""},{"$f":"名簿!I9","v":0},{"$f":"名簿!BP9","v":0},{"$f":"名簿!N9","v":"0"},{"$f":"名簿!R9","v":{"$error":"#REF!"}},{"$f":"名簿!D9","v":""},null,{"$f":"IF(O7=\"\",\"\",IF(I7=1,VLOOKUP(O7,$CG$7:$CH$32,2,FALSE),IF(I7=2,VLOOKUP(O7,$CI$7:$CJ$27,2,FALSE))))","v":""},null,0,2,null,{"$f":"IF(T7=\"\",\"\",IF(I7=1,VLOOKUP(T7,$CG$7:$CH$32,2,FALSE),IF(I7=2,VLOOKUP(T7,$CI$7:$CJ$27,2,FALSE))))","v":""},null,null,{"$f":"IF(W7=\"\",\"\",IF(I7=1,VLOOKUP(W7,#REF!,2,FALSE),IF(I7=2,VLOOKUP(W7,#REF!,2,FALSE))))","v":""},null,null,null,null,{"$f":"IF(AB7=\"\",\"\",IF(I7=1,VLOOKUP(AB7,#REF!,2,FALSE),IF(I7=2,VLOOKUP(AB7,#REF!,2,FALSE))))","v":""},null,0,2,null,{"$f":"IF(AG7=\"\",\"\",IF(I7=1,VLOOKUP(AG7,#REF!,2,FALSE),IF(I7=2,VLOOKUP(AG7,#REF!,2,FALSE))))","v":""},null,0,2,0,null,null,200,{"$f":"IF(O7=\"\",\"\",1)","v":""},{"$f":"IF(T7=\"\",\"\",1)","v":""},null,null,{"$f":"IF(O7=\"\",\"\",1)","v":""},{"$f":"IF(OR(AT7=1,T7=\"\"),0,1)","v":0},{"$f":"IF(OR(AT7=1,AU7=1,AB7=\"\"),0,1)","v":0},{"$f":"IF(OR(AT7=1,AU7=1,AV7=1,AG7=\"\"),0,1)","v":0},{"$f":"SUM(AT7:AW7)","v":0},200,200,"男子B",{"$f":"COUNT(P7,U7)","v":0},{"$f":"COUNT(P7,U7,AC7,AH7)","v":0},{"$f":"IF(I7=1,BC7,\"\")","v":""},{"$f":"IF(I7=2,BC7,\"\")","v":""},"男子",null,"記録",null,"記録",null,"記録",null,"記録",null,null,null,null,null,null,null,null,null,null,null,null,null,null,null,null,null,null,"男子100m",1,"女子100m",40]
[{"$f":"AB8","v":0},{"$f":"名簿!Q10","v":""},{"$f":"AG8","v":0},null,null,null,null,null,null,null,null,null,null,null,null,null,null,null,null,null,null,null,null,{"$f":"IF(W8=\"\",\"\",IF(I8=1,VLOOKUP(W8,#REF!,2,FALSE),IF(I8=2,VLOOKUP(W8,#REF!,2,FALSE))))","v":""},null,null,null,null,{"$f":"IF(AB8=\"\",\"\",IF(I8=1,VLOOKUP(AB8,#REF!,2,FALSE),IF(I8=2,VLOOKUP(AB8,#REF!,2,FALSE))))","v":""},null,0,2,null,{"$f":"IF(AG8=\"\",\"\",IF(I8=1,VLOOKUP(AG8,#REF!,2,FALSE),IF(I8=2,VLOOKUP(AG8,#REF!,2,FALSE))))","v":""},null,0,2,0,null,null,400,{"$f":"IF(O8=\"\",\"\",1)","v":""},{"$f":"IF(T8=\"\",\"\",1)","v":""},null,null,{"$f":"IF(O8=\"\",\"\",1)","v":""},0,0,0,{"$f":"SUM(AT8:AW8)","v":0},400,400,"男子C",{"$f":"COUNT(P8,U8)","v":0},{"$f":"COUNT(O8,T8,AC8,AH8)","v":0},{"$f":"IF(I8=1,BC8,\"\")","v":""},{"$f":"IF(I8=2,BC8,\"\")","v":""},100,{"$f":"COUNTIF($P$7:$P$56,1)+COUNTIF($U$7:$U$56,1)","v":0},{"$f":"IF(ISERROR(BP8),\"\",BP8)","v":""},{"$f":"IF(ISERROR(BQ8),\"\",BQ8)","v":""},{"$f":"IF(ISERROR(BR8),\"\",BR8)","v":""},{"$f":"IF(ISERROR(BS8),\"\",BS8)","v":""},{"$f":"IF(ISERROR(BT8),\"\",BT8)","v":""},{"$f":"IF(ISERROR(BU8),\"\",BU8)","v":""},{"$f":"IF(ISERROR(BV8),\"\",BV8)","v":""},{"$f":"IF(ISERROR(BW8),\"\",BW8)","v":""},{"$error":"#NAME?"},{"$error":"#NAME?"},{"$error":"#NAME?"},{"$error":"#NAME?"},{"$error":"#NAME?"},{"$error":"#NAME?"},{"$error":"#NAME?"},{"$error":"#NAME?"},{"$f":"IF(BH8=\"\",\"\",1)","v":""},{"$f":"IF(BJ8=\"\",\"\",1)","v":""},{"$f":"IF(BL8=\"\",\"\",1)","v":""},{"$f":"IF(BN8=\"\",\"\",1)","v":""},null,null,null,null,null,"男子200m",2,"女子200m",41]
[0,{"$f":"名簿!Q11","v":""},0,null,null,null,null,null,null,null,null,null,null,null,null,null,null,null,null,null,null,null,null,{"$f":"IF(W9=\"\",\"\",IF(I9=1,VLOOKUP(W9,#REF!,2,FALSE),IF(I9=2,VLOOKUP(W9,#REF!,2,FALSE))))","v":""},null,null,null,null,{"$f":"IF(AB9=\"\",\"\",IF(I9=1,VLOOKUP(AB9,#REF!,2,FALSE),IF(I9=2,VLOOKUP(AB9,#REF!,2,FALSE))))","v":""},null,0,2,null,{"$f":"IF(AG9=\"\",\"\",IF(I9=1,VLOOKUP(AG9,#REF!,2,FALSE),IF(I9=2,VLOOKUP(AG9,#REF!,2,FALSE))))","v":""},null,0,2,0,null,null,800,{"$f":"IF(O9=\"\",\"\",1)","v":""},"",null,null,"",0,0,0,0,800,800,"男子D",0,0,"","",200,{"$f":"COUNTIF($P$7:$P$56,2)+COUNTIF($U$7:$U$56,2)","v":0},"","","","","","","","",{"$error":"#NAME?"},{"$error":"#NAME?"},{"$error":"#NAME?"},{"$error":"#NAME?"},{"$error":"#NAME?"},{"$error":"#NAME?"},{"$error":"#NAME?"},{"$error":"#NAME?"},null,null,null,null,null,null,null,null,null,"男子400m",3,"女子400m",42]
[0,{"$f":"名簿!Q12","v":""},0,null,null,"今年度公認記録がない場合は、昨年の公認記録を記載の事。",null,null,null,null,null,null,null,null,null,null,null,null,null,null,null,null,null,{"$f":"IF(W10=\"\",\"\",IF(I10=1,VLOOKUP(W10,#REF!,2,FALSE),IF(I10=2,VLOOKUP(W10,#REF!,2,FALSE))))","v":""},null,null,null,null,{"$f":"IF(AB10=\"\",\"\",IF(I10=1,VLOOKUP(AB10,#REF!,2,FALSE),IF(I10=2,VLOOKUP(AB10,#REF!,2,FALSE))))","v":""},null,0,2,null,{"$f":"IF(AG10=\"\",\"\",IF(I10=1,VLOOKUP(AG10,#REF!,2,FALSE),IF(I10=2,VLOOKUP(AG10,#REF!,2,FALSE))))","v":""},null,0,2,0,null,null,1500,"","",null,null,"",0,0,0,0,1500,1500,"女子A",0,0,"","",400,{"$f":"COUNTIF($P$7:$P$56,3)+COUNTIF($U$7:$U$56,3)","v":0},"","","","","","","","",{"$error":"#NAME?"},{"$error":"#NAME?"},{"$error":"#NAME?"},{"$error":"#NAME?"},{"$error":"#NAME?"},{"$error":"#NAME?"},{"$error":"#NAME?"},{"$error":"#NAME?"},null,null,null,null,null,null,null,null,null,"男子800m",4,"女子800m",43]
{"$rows_left_out":64}
{"sheet":"ロードレース","index":8,"n_rows":72,"n_cols":38,"rows_kept":72,"cut":false,"hidden":false,"merged":[[1,12,1,13],[9,36,9,37],[1,7,1,8],[1,14,1,15],[8,4,8,16]]}
[null,null,null,null,"所属名",{"$f":"IF(名簿!$P$9=\"\",\"\",名簿!$P$9)","v":"三重陸協"},null,null,"中日三重お伊勢さんマラソン公認の部"]
[null,null,null,null,"所属コード",{"$f":"名簿!$Q$9","v":230000}]
[null,null,null,null,"申込者名",{"$f":"IF(名簿!$E$5=\"\",\"\",名簿!$E$5)","v":""}]
[null,null,null,null,"連絡先",{"$f":"IF(名簿!$I$5=\"\",\"\",名簿!$I$5)","v":""},null,null,"大会参加費","5000円"]
[null,null,null,null,"ナンバーカード引換え証を送付しますので、下記を入力願います。"]
[null,null,null,null,"郵便番号"]
[null,null,null,null,"住所"]
[null,null,null,null,"名前",{"$f":"F3","v":""}]
[null,null,null,null,"計測チップを使用します。引換証を受付で提出し、ナンバーをもらって下さい"]
["競技者コード","所属コード",null,null,"登録　　　　　　ナンバー","名前","カナ名","掲示板名","性別","学年又は年齢","生年","生年月日(年)","個人所属地コード","陸連コード","種目","コード","記録",null,null,"今回で連続何回目ですか？",null,null,null,null,null,null,null,null,null,null,null,null,null,null,null,null,"種目別人数"]
{"$rows_left_out":63}
{"sheet":"SF","index":9,"n_rows":57,"n_cols":40,"rows_kept":57,"cut":false,"hidden":false,"merged":[[1,7,1,8],[1,12,1,13],[1,14,1,15],[5,38,5,39]]}
[null,null,null,null,"所属名",{"$f":"IF(名簿!$P$9=\"\",\"\",名簿!$P$9)","v":"三重陸協"},null,null,"みえスポーツフェスティバル"]
[null,null,null,null,"所属コード",{"$f":"名簿!$Q$9","v":230000}]
[null,null,null,null,"申込者名",{"$f":"IF(名簿!$E$5=\"\",\"\",名簿!$E$5)","v":""}]
[null,null,null,null,"連絡先",{"$f":"IF(名簿!$I$5=\"\",\"\",名簿!$I$5)","v":""},null,null,"大会参加費",null,null,null,null,null,{"$f":"AN11*1000+O5*800","v":0}]
[null,null,null,null,null,null,null,null,"プログラム冊数",null,null,null,null,null,null,null,"冊"]
["競技者コード","所属コード",null,null,"ナンバー","名前","カナ名","掲示板名","性別","学年","生年","月日","所属地","陸連コード","種目","コード","記録",null,null,"種目2",null,"記録",null,null,null,null,null,null,null,null,null,null,null,null,null,null,null,null,"種目別人数"]
[null,{"$f":"名簿!Q9","v":230000},null,null,{"$f":"名簿!E9","v":0},{"$f":"名簿!BN9","v":""},{"$f":"名簿!Z9","v":""},{"$f":"F7","v":""},{"$f":"名簿!O9","v":""},{"$f":"名簿!I9","v":0},{"$f":"名簿!BP9","v":0},{"$f":"名簿!N9","v":"0"},{"$f":"名簿!R9","v":{"$error":"#REF!"}},23,null,{"$f":"IF(O7=\"\",\"\",IF($I$7=1,VLOOKUP(O7,#REF!,2,FALSE),IF($I$7=2,VLOOKUP(O7,#REF!,2,FALSE))))","v":""},null,0,2,null,{"$f":"IF(T7=\"\",\"\",IF($I$7=1,VLOOKUP(T7,#REF!,2,FALSE),IF($I$7=2,VLOOKUP(T7,#REF!,2,FALSE))))","v":""},null,null,"2",null,null,null,null,null,null,null,null,null,null,null,null,100,{"$f":"IF(O7=\"\",\"\",1)","v":""},"男子100",{"$f":"COUNTIF($P$7:$P$56,1)+COUNTIF($U$7:$U$56,1)","v":0}]
[null,{"$f":"名簿!Q10","v":""},null,null,null,null,null,null,null,null,null,null,null,null,null,null,null,0,2,null,null,null,null,null,null,null,null,null,null,null,null,null,null,null,null,null,3000,"","男子5000",{"$f":"COUNTIF($P$7:$P$56,3)+COUNTIF($U$7:$U$56,3)","v":0}]
[null,{"$f":"名簿!Q11","v":""},null,null,null,null,null,null,null,null,null,null,null,null,null,null,null,0,2,null,null,null,null,null,null,null,null,null,null,null,null,null,null,null,null,null,5000,"","女子100",{"$f":"COUNTIF($P$7:$P$56,5)+COUNTIF($U$7:$U$56,5)","v":0}]
[null,{"$f":"名簿!Q12","v":""},null,null,null,null,null,null,null,null,null,null,null,null,null,null,null,0,2,null,null,null,null,null,null,null,null,null,null,null,null,null,null,null,null,null,null,"","一般高校女子3000",{"$f":"COUNTIF($P$7:$P$56,6)+COUNTIF($U$7:$U$56,6)","v":0}]
{"$rows_left_out":48}
{"sheet":"振込票貼付用紙","index":10,"n_rows":46,"n_cols":11,"rows_kept":46,"cut":false,"hidden":false,"merged":[[7,10,27,10],[0,0,0,9],[45,4,45,5],[46,4,46,5],[44,4,44,5],[44,6,44,7]]}
["大会参加料　振込票貼付用紙"]
[]
["大会名",null,"三重陸協記録会"]
[]
["所属名",null,{"$f":"名簿!P9","v":"三重陸協"},null,null,null,null,null,{"$f":"名簿!Q9","v":230000}]
[]
["個人名",null,{"$f":"名簿!E5","v":0},null,null,"連絡先",{"$f":"名簿!I5","v":0}]
[null,null,null,null,null,null,null,null,null,null,"メニューへ戻り、上書き保存して下さい"]
[]
[]
{"$rows_left_out":37}
{"sheet":"作業","index":11,"n_rows":1,"n_cols":4,"rows_kept":1,"cut":false,"hidden":false,"merged":[]}
[1,"選　手","コード","コード"]